compile problem with Linux/Alpha

Henri Sundelin hs at
Wed Jul 9 11:46:26 PDT 1997

When I try to build kaffe-0.9.1 with Linux/Alpha I get this:

make[2]: Entering directory `/usr/local/src/kaffe-0.9.1/kaffe/kaffevm'
gcc -g -O  -I. -I. -I./../../config -I../../config -I../../include -I./../../include -DTRANSLATOR -I./jit -DKVER=\"0.91\" -c -fPIC ./jit/funcs.c
jit.def: In function `prologue_xxC':
In file included from ./jit/funcs.c:45:
jit.def:655: structure has no member named `ins'
trampolines.c: At top level:
In file included from ./jit/funcs.c:48:
trampolines.c:30: redefinition of `silly_wrapper_2'
jit.def:3033: `silly_wrapper_2' previously defined here
make[2]: *** [funcs.o] Error 1
make[2]: Leaving directory `/usr/local/src/kaffe-0.9.1/kaffe/kaffevm'
make[1]: *** [all] Error 1
make[1]: Leaving directory `/usr/local/src/kaffe-0.9.1/kaffe'
make: *** [all] Error 1

Any fix for this?

Henri Sundelin

More information about the kaffe mailing list