make check

alice dubois alice.dubois at
Mon Jan 18 01:03:58 PST 1999


When I run make check on my red-hat Linux, everything is correct (except 
UDPTest: UDPTest ... output saved to until ExecTest. When this
 test arrives, it stops and I must press "control C" to continue.
TestScript and TestScriptThread : FAIL

MarkResetTest ... passed
HashtableTest1 ... passed
FAIL: TestScript
ExecTest (I press control C here) ... ERROR: output saved to
CatchDeath ... ignored
ThreadStop ... ignored
DeadThread ... passed
tthrd1 ... passed
FAIL: TestScriptThread
2 of 2 tests failed
make[3]: *** [check-TESTS] Error 1
make[2]: *** [check-am] Interruption.
make[1]: *** [check-recursive] Interruption.
make: *** [check-recursive] Interruption.  

What Can I do ?



More information about the kaffe mailing list