[kaffe] kaffe-1.1.4 'make' fails on alpha arch..

mel kravitz melk at switchpwr.com
Mon Mar 21 16:47:32 PST 2005

having trouble completing 'make' on my debian kernel 2.6.10 unstable box 
the error i get:
make[1]: Entering directory `/home/mel/kaffe-1.1.4/test'
Making all in regression
make[2]: Entering directory `/home/mel/kaffe-1.1.4/test/regression'
Making all in compile_time
make[3]: Entering directory 
Internal error: caught an unexpected exception.
Please check your CLASSPATH and your installation.
make[3]: *** [ClassToInterface.class] Aborted
make[3]: Leaving directory 
make[2]: *** [all-recursive] Error 1
make[2]: Leaving directory `/home/mel/kaffe-1.1.4/test/regression'
make[1]: *** [all-recursive] Error 1
make[1]: Leaving directory `/home/mel/kaffe-1.1.4/test'
make: *** [all-recursive] Error 1
any help appreciated.

More information about the kaffe mailing list