[kaffe] error building kaffe 1.1.6

George P Nychis gnychis at cmu.edu
Mon Jan 16 20:05:41 PST 2006


Just yesterday I was able to make a complete build of Kaffe 1.1.6.  Today I updated "world" in Gentoo, and it will no longer build.  I changed no source code and even tried redownloading, cleaning, and re-making.  Here is the error i get:

In file included from org_tritonus_lowlevel_alsa_AlsaSeq.c:25:
constants_check.h: In function `check_constants':
constants_check.h:139: error: `SND_SEQ_CLIENT_DUMMY' undeclared (first use in this function)
constants_check.h:139: error: (Each undeclared identifier is reported only once
constants_check.h:139: error: for each function it appears in.)
constants_check.h:140: error: `SND_SEQ_CLIENT_OSS' undeclared (first use in this function)
make[3]: *** [libtritonusalsa_la-org_tritonus_lowlevel_alsa_AlsaSeq.lo] Error 1
make[3]: Leaving directory `/home/hedpe/school/Kaffe/kaffe-1.1.6/libraries/clib/sound/alsa'
make[2]: *** [all-recursive] Error 1
make[2]: Leaving directory `/home/hedpe/school/Kaffe/kaffe-1.1.6/libraries/clib/sound'
make[1]: *** [all-recursive] Error 1
make[1]: Leaving directory `/home/hedpe/school/Kaffe/kaffe-1.1.6/libraries/clib'
make: *** [all-recursive] Error 1

Any ideas?


More information about the kaffe mailing list