[kaffe] error during checking kaffe

vibi vibi_sreenivasan at cms.com
Sat Jan 6 02:12:09 PST 2007

hello ,
        i was trying to compile kaffe 1.1.7 for i686 architecture.

i got an error when i ran "make check" after "make".following are the
output which i got 


Method Constant Pool:
soft_fixup_trampoline(): return 0x81791c0
Internal error: caught an unexpected exception.
Please check your CLASSPATH and your installation.
/bin/sh: line 1: 17525 Aborted                 env
TEST_CLASSES="ConstMethods.class ConstMathMethods.class
ParameterizedMethods.class ParameterizedMathMethods.class
ParameterizedLogicalMethods.class ParameterizedBitwiseMethods.class
ControlFlowMethods.class StaticMethodCall.class TypeConversion.class
StaticFields.class PrimitiveArrays.class ObjectFields.class
MethodOptimizations.class NativeMethodCall.class Exceptions.class
VirtualMethod.class" `. ../../BUILD_ENVIRONMENT; BOOTCLASSPATH=.:\
${BOOTCLASSPATH}; export BOOTCLASSPATH; sed 's/.*export \(.*\)/echo \1=
$\1/' < ../../BUILD_ENVIRONMENT | sh` ${dir}$tst
FAIL: jitBasic
1 of 1 tests failed
Please report to kaffe at kaffe.org
make[5]: *** [check-TESTS] Error 1
make[5]: Leaving directory `/test/kaffe-1.1.7/test/internal'
make[4]: *** [check-am] Error 2
make[4]: Leaving directory `/test/kaffe-1.1.7/test/internal'
make[3]: *** [check-recursive] Error 1
make[3]: Leaving directory `/test/kaffe-1.1.7/test'
make[2]: *** [check-local] Error 2
make[2]: Leaving directory `/test/kaffe-1.1.7'
make[1]: *** [check-am] Error 2
make[1]: Leaving directory `/test/kaffe-1.1.7'
make: *** [check-recursive] Error 1


can any one help me with this


vibi sreenivasan

More information about the kaffe mailing list