[kaffe] problem installing kaffe during make check ...

sreejith k s sreejithvadhyar at gmail.com
Sat Jan 12 09:17:24 PST 2008

After make install is done ..then to check it i ran make check ..it showed
the following

Method Constant Pool:
soft_fixup_trampoline(): return 0x817a120
Internal error: caught an unexpected exception.
Please check your CLASSPATH and your installation.
/bin/bash: line 4:  1498 Aborted                 (core dumped) env
TEST_CLASSES="ConstMethods.class ConstMathMethods.class
ParameterizedBitwiseMethods.class ControlFlowMethods.class
StaticMethodCall.class TypeConversion.class StaticFields.class
PrimitiveArrays.class ObjectFields.class MethodOptimizations.class
NativeMethodCall.class Exceptions.class VirtualMethod.class" `.
BOOTCLASSPATH; sed 's/.*export \(.*\)/echo \1=$\1/' <
../../BUILD_ENVIRONMENT | sh` ${dir}$tst
FAIL: jitBasic
1 of 1 tests failed
Please report to kaffe at kaffe.org
make[5]: *** [check-TESTS] Error 1
make[5]: Leaving directory `/home/sreejith/Desktop/kaffe-1.1.7
make[4]: *** [check-am] Error 2
make[4]: Leaving directory `/home/sreejith/Desktop/kaffe-1.1.7
make[3]: *** [check-recursive] Error 1
make[3]: Leaving directory `/home/sreejith/Desktop/kaffe-1.1.7/test'
make[2]: *** [check-local] Error 2
make[2]: Leaving directory `/home/sreejith/Desktop/kaffe-1.1.7'
make[1]: *** [check-am] Error 2
make[1]: Leaving directory `/home/sreejith/Desktop/kaffe-1.1.7'
make: *** [check-recursive] Error 1

how should i proceed now?

Sreejith K.s
-------------- next part --------------
An HTML attachment was scrubbed...
URL: http://kaffe.org/pipermail/kaffe/attachments/20080112/937bb14a/attachment-0004.htm 

More information about the kaffe mailing list