Compiliation errors on Linux

Rama Krishna Reddy K. ramky at
Mon Apr 14 02:06:49 PDT 1997

	I am not able to compile kaffe-0.8.3 on Linux box.
	Can you help me?

gcc -g -O  -I. -I. -I./../../config -I../../config -I../../include
-DTRANSLATOR -I./jit -DKVER=\"0.83\" -c -fPIC external.c
external.c:67: parse error before `libHandle'
external.c:67: warning: data definition has no type or storage class
make[2]: *** [external.o] Error 1
make[2]: Leaving directory `/tmp/kaffe-0.8.3/kaffe/kaffevm'
make[1]: *** [all] Error 1
make[1]: Leaving directory `/tmp/kaffe-0.8.3/kaffe'
make: *** [all] Error 1
ramky:/tmp/kaffe-0.8.3$ uname -a
Linux ramky 2.0.0 #2 Fri Jan 24 16:31:58 GMT+0500 1997 i586


More information about the kaffe mailing list