[kaffe] [ClassToInterface.class] Segmentation fault

C. Brian Jones cbj at gnu.org
Sat Jan 3 22:05:02 PST 2004

Wanted to test serialization using kaffe 1.1.3 but make fails as
reported here,
http://www.kaffe.org/pipermail/kaffe/2004-January/044814.html.  I think
a fix might be in CVS, but unsure of whether to try building from CVS...
let me know (I'm not on the mailing list).

make[1]: Entering directory `/home/cbj/kaffe-1.1.3/test'
Making all in regression
make[2]: Entering directory `/home/cbj/kaffe-1.1.3/test/regression'
Making all in compile_time
make[3]: Entering directory
`/home/cbj/kaffe-1.1.3/test/regression/compile_time'make[3]: ***
[ClassToInterface.class] Segmentation fault
make[3]: Leaving directory
make[2]: *** [all-recursive] Error 1
make[2]: Leaving directory `/home/cbj/kaffe-1.1.3/test/regression'
make[1]: *** [all-recursive] Error 1
make[1]: Leaving directory `/home/cbj/kaffe-1.1.3/test'
make: *** [all-recursive] Error 1

-------------- next part --------------
A non-text attachment was scrubbed...
Name: not available
Type: application/pgp-signature
Size: 189 bytes
Desc: This is a digitally signed message part
Url : http://kaffe.org/pipermail/kaffe/attachments/20040103/6588b5d5/attachment-0002.pgp 

More information about the kaffe mailing list